{"text_format":"1","workbook":"xlsx","n_sheets":13,"sheets":["evalerg","ESQUEMA CONCEPTUAL","EF.REF.,RELEV.Y EF.ADIM.","COSTOS","ALT.1","ALT.2","ALT.3","ALT.4","ALT.5","ALT.6","RESULTADOS","RANKING","IMPRIMIR"],"not_rendered":{"charts":0,"images":0,"macros":1,"external_links":0,"defined_names":12,"comments":12,"pivot_tables":0},"unopened":[],"bounds":{"document_bytes":16777216,"sheet_cells":100000,"rows_first":2000,"rows_last":500,"rows_between":2000,"halvings":0,"cell_chars":16384,"cell_head_chars":4096},"cells_cut":0,"cells_raw":0,"read":"whole","date_system":"1900"}

{"sheet":"evalerg","index":0,"n_rows":29,"n_cols":12,"rows_kept":29,"cut":false,"hidden":false,"merged":[[7,4,8,6],[20,1,22,9],[24,0,24,4],[9,1,19,9],[28,0,29,10],[25,2,25,4],[25,6,25,9],[26,6,26,9],[26,1,26,4]]}
[]
[]
[]
[]
[]
[]
[]
[null,null,null,null,"VERSIÓN b"]
[]
[null,"Este es un programa diseñado para la evaluación multidimensional y sistémico-jerárquica de hasta seis alternativas ergonómicas, considerando a tres factores y a siete subfactores de decisión de segundo nivel y a diecinueve subfactores de tercer nivel, con sinergia parcial y predeterminada, dimensionado para un período de evaluación de hasta cinco años, según el esquema conceptual de las variables intervinientes que se muestra en la hoja siguiente. El programa evalerg se basa en la metodología de evaluación multidimensional esbozada en el artículo al cual se adjunta. Antes de ser utilizado se recomienda copiarlo tantas veces como se requiera y conservar este archivo como programa madre. Las instrucciones para operar este programa se encuentran detalladas en dicho artículo. También aparecen guías de uso como comentarios en las hojas del programa, las que se leen colocando el puntero sobre los signos de información i correspondientes. Cuando está vacío de datos como se lo entrega aparecerá en muchas celdas la indicación de división por cero; una vez completados los datos el cálculo se normaliza. El programa funciona en Excel 2010, posteriores y compatibles."]
{"$rows_left_out":20}
{"sheet":"ESQUEMA CONCEPTUAL","index":1,"n_rows":23,"n_cols":6,"rows_kept":23,"cut":false,"hidden":false,"merged":[[20,3,21,3],[21,1,22,1],[0,1,0,5],[4,3,4,4],[4,2,5,2],[1,2,1,5],[9,1,10,1],[9,2,10,2],[9,3,10,3]]}
[null,"programa evalerg AdEA"]
[null,"i","ESQUEMA CONCEPTUAL GENERAL"]
[null,"FACTORES","i EVALUACIÓN","SUBFACTORES","SUBFACTORES","ESCALAS DE MEDICIÓN"]
[null,"EN NIVEL -1","DE RELEVANCIAS","EN NIVEL -2","EN NIVEL -3","DE LOS EFECTOS"]
[null,"i",null,"OCUPACION (SF A.1)",null,"Nº de SSH por cada SHM"]
[null,"i",null,null,"CREATIVA","escala cualicuantitativa"]
[null,"PARTICIPACION","ER F A","PARTICIPACION","ECONOMICA","(um/año)promedio"]
[null,"(F A)",3,"PROMEDIO","PSICOSOCIAL","escala cualicuantitativa"]
[null,null,null,"(SF A.2)","DECISIONAL","escala cualicuantitativa"]
[null,"i","ER SF B.1","i EFICACIA","CAPACIDAD UNITARIA DE PRODUCC.","up/año"]
{"$rows_left_out":14}
{"sheet":"EF.REF.,RELEV.Y EF.ADIM.","index":2,"n_rows":29,"n_cols":21,"rows_kept":29,"cut":false,"hidden":false,"merged":[[1,0,2,3],[1,4,2,15],[0,0,0,20],[3,18,7,20],[1,19,2,20],[1,16,2,18],[4,12,4,15],[5,11,5,12],[5,13,5,14],[5,15,5,16],[3,3,3,16],[15,0,16,2],[4,7,4,10],[4,4,7,4],[8,0,12,2],[5,5,7,5],[5,6,7,6],[4,5,4,6],[4,0,7,3],[13,0,14,2],[6,9,6,10],[8,5,8,6],[6,7,6,8],[5,9,5,10],[5,7,5,8],[16,18,17,18],[16,19,17,19],[16,20,17,20],[6,11,6,12],[6,13,6,14],[6,15,6,16],[8,18,9,18],[8,19,9,19],[8,20,9,20],[4,17,7,17],[28,5,28,6],[27,5,27,6],[27,13,27,14],[28,15,28,16],[28,13,28,14],[28,11,28,12],[27,7,27,8],[28,7,28,8],[28,9,28,10],[27,9,27,10],[27,15,27,16],[27,11,27,12],[17,0,19,2],[20,0,23,2],[24,0,26,2],[27,0,27,4],[28,0,28,4]]}
["      programa evalerg AdEA"]
["DENOMINACIÓN DE LA EVALUACION: ",null,null,null,null,null,null,null,null,null,null,null,null,null,null,null,"FECHA DE REFERENCIA"]
[]
["i","i","i"," EFECTOS DE REFERENCIA, EVALUACIONES DE RELEVANCIA Y GRADOS DE IMPORTANCIA ",null,null,null,null,null,null,null,null,null,null,null,null,null,"i","EFECTOS DE REFERENCIA                     EN EL AÑO 1 PARA EL                                      SUBFACTOR EFICIENCIA "]
["FACTORES Y SUBFACTORES",null,null,null,"ESCALAS DE MEDICION DE EFECTOS","GRAD. IMPORT.",null,"NUMERO DE AÑOS (hasta 5)",null,null,null,1,"NUMERO DE ALTERNATIVAS (hasta 6)",null,null,null,1,"EFECTOS ADIMEN-                      SIONANTES"]
[null,null,null,null,null,"ABSOL.","RELAT.","AÑO",null,"AÑO",null,"AÑO",null,"AÑO",null,"AÑO"]
[null,null,null,null,null,null,null,1,null,2,null,3,null,4,null,5]
[null,null,null,null,null,null,null,"EFECT. REF.","RELEVANC.","EFECT. REF.","RELEVANC.","EFECT. REF.","RELEVANC.","EFECT. REF.","RELEVANC.","EFECT. REF.","RELEVANC."]
["PARTICIPACION               (F A)",null,null,"OCUPACION","nro. de SSH por SHM","*****",null,null,null,null,null,null,null,null,null,null,null,{"$f":"+(IF($H$7>$L$5,0,$H9)+IF($J$7>$L$5,0,$J9)+IF($L$7>$L$5,0,$L9)+IF($N$7>$L$5,0,$N9)+IF($P$7>$L$5,0,$P9))/$L$5","v":0},"ALTER-          NATIVA","CIU DEL AÑO 1","COU DEL AÑO 1"]
[null,null,null,"PARTICIPACION CREATIVA","escala cualicuantitativa",null,{"$f":"+F10*4/SUM($F$10:$F$13)","v":{"$error":"#DIV/0!"}},null,{"$f":"+(I$9)/(ABS(I$9)+ABS(I$14)+ABS(I$16)+ABS(I$18)+ABS(I$21)+ABS(I$25))","v":{"$error":"#DIV/0!"}},null,{"$f":"+(K$9)/(ABS(K$9)+ABS(K$14)+ABS(K$16)+ABS(K$18)+ABS(K$21)+ABS(K$25))","v":{"$error":"#DIV/0!"}},null,{"$f":"+(M$9)/(ABS(M$9)+ABS(M$14)+ABS(M$16)+ABS(M$18)+ABS(M$21)+ABS(M$25))","v":{"$error":"#DIV/0!"}},null,{"$f":"+(O$9)/(ABS(O$9)+ABS(O$14)+ABS(O$16)+ABS(O$18)+ABS(O$21)+ABS(O$25))","v":{"$error":"#DIV/0!"}},null,{"$f":"+(Q$9)/(ABS(Q$9)+ABS(Q$14)+ABS(Q$16)+ABS(Q$18)+ABS(Q$21)+ABS(Q$25))","v":{"$error":"#DIV/0!"}},{"$f":"+(IF($H$7>$L$5,0,$H10)+IF($J$7>$L$5,0,$J10)+IF($L$7>$L$5,0,$L10)+IF($N$7>$L$5,0,$N10)+IF($P$7>$L$5,0,$P10))/$L$5","v":0}]
{"$rows_left_out":20}
{"sheet":"COSTOS","index":3,"n_rows":32,"n_cols":8,"rows_kept":32,"cut":false,"hidden":false,"merged":[[23,1,23,4],[4,1,5,1],[14,1,15,1],[24,1,25,1],[0,0,0,7],[14,5,15,5],[14,6,15,6],[3,1,3,5],[13,1,13,7],[1,1,1,7],[17,3,21,3]]}
["             programa evalerg AdEA"]
["i","COSTO POR INVERSION ANUAL Y COSTOS ANUALES OPERATIVOS FIJOS Y VARIABLES"]
[]
["i","COSTO POR INVERSION ANUAL (CINVA) DE UN SSM",null,null,null,null,null,"Nº DE AÑOS"]
["ALTERNATIVA","DENOMINACIÓN","INVERSION","VIDA UTIL","VALOR RECUP.","CINVA",null,{"$f":"+'EF.REF.,RELEV.Y EF.ADIM.'!$L$5","v":1}]
["Nº",null,"(um)","(años)","(um)","(um/año)",null,"Nª ALTERN."]
[1,"Escribir denominación alternativa 1",0,0,{"$f":"+IF($D7>$H$5,$C7*($D7-$H$5)/$D7,0)","v":0},{"$f":"+IF(D7<=$H$5,0,(C7-E7)*(($H$9*((1+$H$9)^D7)))/(((1+$H$9)^D7)-1))+E7*$H$9","v":0},null,{"$f":"+'EF.REF.,RELEV.Y EF.ADIM.'!$Q$5","v":1}]
[2,"Escribir denominación alternativa 2",0,1E-3,0,{"$f":"+IF(D8<=$H$5,0,(C8-E8)*(($H$9*((1+$H$9)^D8)))/(((1+$H$9)^D8)-1))+E8*$H$9","v":0},null,"tum (pu)"]
[3,"Escribir denominación alternativa 3",0,0,0,0,null,{"$f":"+'EF.REF.,RELEV.Y EF.ADIM.'!$F$18","v":0}]
[4,"Escribir denominación alternativa 4",0,0,0,0,null,"u.m."]
{"$rows_left_out":23}
{"sheet":"ALT.1","index":4,"n_rows":31,"n_cols":8,"rows_kept":31,"cut":false,"hidden":false,"merged":[[3,0,3,1],[1,1,2,2],[1,0,2,0],[0,2,0,7],[4,0,5,1],[3,2,3,7],[1,4,2,4],[1,6,2,7],[1,3,2,3],[5,3,5,7],[29,0,29,2],[30,0,30,2],[12,0,14,0],[6,0,10,0],[24,0,26,0],[28,0,28,1],[19,0,19,2],[27,0,27,2],[11,0,11,2],[15,0,16,0]]}
["i","i","programa evalerg AdEA"]
["DENOMINACIÓN        EVALUACIÓN",{"$f":"+'EF.REF.,RELEV.Y EF.ADIM.'!E2","v":0},null,{"$f":"+IF(H31>=1,\"ALTERNATIVA\",\" ALTERNATIVA \")","v":"ALTERNATIVA"},{"$f":"+IF($H$31>=1,1,\"VACÍA\")","v":1},"DENOMINAC. ",{"$f":"+COSTOS!B7","v":"Escribir denominación alternativa 1"}]
[null,null,null,null,null,"ALTERNATIVA"]
[{"$f":"+IF(D2=\"ALTERNATIVA\",\"DESCRIPCIÓN:\",\"SIN DESCRIPCIÓN\")","v":"DESCRIPCIÓN:"}]
["FACTORES Y SUBFACTORES",null,"AÑOS:",1,2,3,4,5]
[null,null,"ESC. MEDIC. EFECT.","EFECTOS ANUALES"]
["PARTICI- PACION                         (F A)","OCUPACION","nro. de SSH por SHM"]
[null,"PARTICIPACION CREATIVA","escala cualicuantitativa",1]
[null,"PARTICIPACION ECONOMICA","(um/año)promedio",{"$f":"+COSTOS!$C$17","v":9.9999999999999995E-8},{"$f":"+COSTOS!$C$17","v":9.9999999999999995E-8},{"$f":"+COSTOS!$C$17","v":9.9999999999999995E-8},{"$f":"+COSTOS!$C$17","v":9.9999999999999995E-8},{"$f":"+COSTOS!$C$17","v":9.9999999999999995E-8}]
[null,"PARTICIPACION PSICOSOCIAL","escala cualicuantitativa"]
{"$rows_left_out":22}
{"sheet":"ALT.2","index":5,"n_rows":31,"n_cols":8,"rows_kept":31,"cut":false,"hidden":false,"merged":[[30,0,30,2],[4,0,5,1],[6,0,10,0],[12,0,14,0],[24,0,26,0],[28,0,28,1],[29,0,29,2],[11,0,11,2],[19,0,19,2],[27,0,27,2],[15,0,16,0],[5,3,5,7],[0,2,0,7],[1,3,2,3],[1,0,2,0],[1,4,2,4],[3,0,3,1],[3,2,3,7],[1,6,2,7],[1,1,2,2]]}
["i","i","programa evalerg AdEA"]
["DENOMINACIÓN        EVALUACIÓN",{"$f":"+'EF.REF.,RELEV.Y EF.ADIM.'!E2","v":0},null,{"$f":"+IF(H31>=2,\"ALTERNATIVA\",\" ALTERNATIVA \")","v":" ALTERNATIVA "},{"$f":"+IF($H$31>=2,2,\"VACÍA\")","v":"VACÍA"},"DENOMINAC. ",{"$f":"+COSTOS!B8","v":"Escribir denominación alternativa 2"}]
[null,null,null,null,null,"ALTERNATIVA"]
[{"$f":"+IF(D2=\"ALTERNATIVA\",\"DESCRIPCIÓN:\",\"SIN DESCRIPCIÓN\")","v":"SIN DESCRIPCIÓN"}]
["FACTORES Y SUBFACTORES",null,"AÑOS:",1,2,3,4,5]
[null,null,"ESC. MEDIC. EFECT.","EFECTOS ANUALES"]
["PARTICIPACION                         (F A)","OCUPACION","nro. de SSH por SHM"]
[null,"PARTICIPACION CREATIVA","escala cualicuantitativa"]
[null,"PARTICIPACION ECONOMICA","(um/año)promedio",{"$f":"+COSTOS!$C$18","v":9.9999999999999995E-8},{"$f":"+COSTOS!$C$18","v":9.9999999999999995E-8},{"$f":"+COSTOS!$C$18","v":9.9999999999999995E-8},{"$f":"+COSTOS!$C$18","v":9.9999999999999995E-8},{"$f":"+COSTOS!$C$18","v":9.9999999999999995E-8}]
[null,"PARTICIPACION PSICOSOCIAL","escala cualicuantitativa"]
{"$rows_left_out":22}
{"sheet":"ALT.3","index":6,"n_rows":31,"n_cols":8,"rows_kept":31,"cut":false,"hidden":false,"merged":[[30,0,30,2],[4,0,5,1],[6,0,10,0],[12,0,14,0],[24,0,26,0],[28,0,28,1],[29,0,29,2],[11,0,11,2],[19,0,19,2],[27,0,27,2],[15,0,16,0],[5,3,5,7],[0,2,0,7],[1,3,2,3],[1,0,2,0],[1,4,2,4],[3,0,3,1],[3,2,3,7],[1,6,2,7],[1,1,2,2]]}
["i","i","programa evalerg AdEA"]
["DENOMINACIÓN        EVALUACIÓN",{"$f":"+'EF.REF.,RELEV.Y EF.ADIM.'!E2","v":0},null,{"$f":"+IF(H31>=3,\"ALTERNATIVA\",\" ALTERNATIVA \")","v":" ALTERNATIVA "},{"$f":"+IF($H$31>=3,3,\"VACÍA\")","v":"VACÍA"},"DENOMINAC. ",{"$f":"+COSTOS!B9","v":"Escribir denominación alternativa 3"}]
[null,null,null,null,null,"ALTERNATIVA"]
[{"$f":"+IF(D2=\"ALTERNATIVA\",\"DESCRIPCIÓN:\",\"SIN DESCRIPCIÓN\")","v":"SIN DESCRIPCIÓN"}]
["FACTORES Y SUBFACTORES",null,"AÑOS:",1,2,3,4,5]
[null,null,"ESC. MEDIC. EFECT.","EFECTOS ANUALES"]
["PARTICIPACION                         (F A)","OCUPACION","nro. de SSH por SHM"]
[null,"PARTICIPACION CREATIVA","escala cualicuantitativa"]
[null,"PARTICIPACION ECONOMICA","(um/año)promedio",{"$f":"+COSTOS!$C$19","v":9.9999999999999995E-8},{"$f":"+COSTOS!$C$19","v":9.9999999999999995E-8},{"$f":"+COSTOS!$C$19","v":9.9999999999999995E-8},{"$f":"+COSTOS!$C$19","v":9.9999999999999995E-8},{"$f":"+COSTOS!$C$19","v":9.9999999999999995E-8}]
[null,"PARTICIPACION PSICOSOCIAL","escala cualicuantitativa"]
{"$rows_left_out":22}
{"sheet":"ALT.4","index":7,"n_rows":31,"n_cols":8,"rows_kept":31,"cut":false,"hidden":false,"merged":[[30,0,30,2],[4,0,5,1],[6,0,10,0],[12,0,14,0],[24,0,26,0],[28,0,28,1],[29,0,29,2],[11,0,11,2],[19,0,19,2],[27,0,27,2],[15,0,16,0],[5,3,5,7],[0,2,0,7],[1,3,2,3],[1,0,2,0],[1,4,2,4],[3,0,3,1],[3,2,3,7],[1,6,2,7],[1,1,2,2]]}
["i","i","programa evalerg AdEA"]
["DENOMINACIÓN        EVALUACIÓN",{"$f":"+'EF.REF.,RELEV.Y EF.ADIM.'!E2","v":0},null,{"$f":"+IF(H31>=4,\"ALTERNATIVA\",\" ALTERNATIVA \")","v":" ALTERNATIVA "},{"$f":"+IF($H$31>=4,4,\"VACÍA\")","v":"VACÍA"},"DENOMINAC. ",{"$f":"+COSTOS!B10","v":"Escribir denominación alternativa 4"}]
[null,null,null,null,null,"ALTERNATIVA"]
[{"$f":"+IF(D2=\"ALTERNATIVA\",\"DESCRIPCIÓN:\",\"SIN DESCRIPCIÓN\")","v":"SIN DESCRIPCIÓN"}]
["FACTORES Y SUBFACTORES",null,"AÑOS:",1,2,3,4,5]
[null,null,"ESC. MEDIC. EFECT.","EFECTOS ANUALES"]
["PARTICIPACION                         (F A)","OCUPACION","nro. de SSH por SHM"]
[null,"PARTICIPACION CREATIVA","escala cualicuantitativa"]
[null,"PARTICIPACION ECONOMICA","(um/año)promedio",{"$f":"+COSTOS!$C$20","v":9.9999999999999995E-8},{"$f":"+COSTOS!$C$20","v":9.9999999999999995E-8},{"$f":"+COSTOS!$C$20","v":9.9999999999999995E-8},{"$f":"+COSTOS!$C$20","v":9.9999999999999995E-8},{"$f":"+COSTOS!$C$20","v":9.9999999999999995E-8}]
[null,"PARTICIPACION PSICOSOCIAL","escala cualicuantitativa"]
{"$rows_left_out":22}
{"sheet":"ALT.5","index":8,"n_rows":31,"n_cols":8,"rows_kept":31,"cut":false,"hidden":false,"merged":[[30,0,30,2],[4,0,5,1],[6,0,10,0],[12,0,14,0],[24,0,26,0],[28,0,28,1],[29,0,29,2],[11,0,11,2],[19,0,19,2],[27,0,27,2],[15,0,16,0],[5,3,5,7],[0,2,0,7],[1,3,2,3],[1,0,2,0],[1,4,2,4],[3,0,3,1],[3,2,3,7],[1,6,2,7],[1,1,2,2]]}
["i","i","programa evalerg AdEA"]
["DENOMINACIÓN        EVALUACIÓN",{"$f":"+'EF.REF.,RELEV.Y EF.ADIM.'!E2","v":0},null,{"$f":"+IF(H31>=5,\"ALTERNATIVA\",\" ALTERNATIVA \")","v":" ALTERNATIVA "},{"$f":"+IF($H$31>=5,5,\"VACÍA\")","v":"VACÍA"},"DENOMINAC. ",{"$f":"+COSTOS!B11","v":"Escribir denominación alternativa 5"}]
[null,null,null,null,null,"ALTERNATIVA"]
[{"$f":"+IF(D2=\"ALTERNATIVA\",\"DESCRIPCIÓN:\",\"SIN DESCRIPCIÓN\")","v":"SIN DESCRIPCIÓN"}]
["FACTORES Y SUBFACTORES",null,"AÑOS:",1,2,3,4,5]
[null,null,"ESC. MEDIC. EFECT.","EFECTOS ANUALES"]
["PARTICIPACION                         (F A)","OCUPACION","nro. de SSH por SHM"]
[null,"PARTICIPACION CREATIVA","escala cualicuantitativa"]
[null,"PARTICIPACION ECONOMICA","(um/año)promedio",{"$f":"+COSTOS!$C$21","v":9.9999999999999995E-8},{"$f":"+COSTOS!$C$21","v":9.9999999999999995E-8},{"$f":"+COSTOS!$C$21","v":9.9999999999999995E-8},{"$f":"+COSTOS!$C$21","v":9.9999999999999995E-8},{"$f":"+COSTOS!$C$21","v":9.9999999999999995E-8}]
[null,"PARTICIPACION PSICOSOCIAL","escala cualicuantitativa"]
{"$rows_left_out":22}
{"sheet":"ALT.6","index":9,"n_rows":31,"n_cols":8,"rows_kept":31,"cut":false,"hidden":false,"merged":[[30,0,30,2],[4,0,5,1],[6,0,10,0],[12,0,14,0],[24,0,26,0],[28,0,28,1],[29,0,29,2],[11,0,11,2],[19,0,19,2],[27,0,27,2],[15,0,16,0],[5,3,5,7],[0,2,0,7],[1,3,2,3],[1,0,2,0],[1,4,2,4],[3,0,3,1],[3,2,3,7],[1,6,2,7],[1,1,2,2]]}
["i","i","programa evalerg AdEA"]
["DENOMINACIÓN        EVALUACIÓN",{"$f":"+'EF.REF.,RELEV.Y EF.ADIM.'!E2","v":0},null,{"$f":"+IF(H31>=6,\"ALTERNATIVA\",\" ALTERNATIVA \")","v":" ALTERNATIVA "},{"$f":"+IF($H$31>=6,6,\"VACÍA\")","v":"VACÍA"},"DENOMINAC. ",{"$f":"+COSTOS!B12","v":"Escribir denominación alternativa 6"}]
[null,null,null,null,null,"ALTERNATIVA"]
[{"$f":"+IF(D2=\"ALTERNATIVA\",\"DESCRIPCIÓN:\",\"SIN DESCRIPCIÓN\")","v":"SIN DESCRIPCIÓN"}]
["FACTORES Y SUBFACTORES",null,"AÑOS:",1,2,3,4,5]
[null,null,"ESC. MEDIC. EFECT.","EFECTOS ANUALES"]
["PARTICIPACION                         (F A)","OCUPACION","nro. de SSH por SHM"]
[null,"PARTICIPACION CREATIVA","escala cualicuantitativa"]
[null,"PARTICIPACION ECONOMICA","(um/año)promedio",{"$f":"+COSTOS!$C$21","v":9.9999999999999995E-8},{"$f":"+COSTOS!$C$21","v":9.9999999999999995E-8},{"$f":"+COSTOS!$C$21","v":9.9999999999999995E-8},{"$f":"+COSTOS!$C$21","v":9.9999999999999995E-8},{"$f":"+COSTOS!$C$21","v":9.9999999999999995E-8}]
[null,"PARTICIPACION PSICOSOCIAL","escala cualicuantitativa"]
{"$rows_left_out":22}
{"sheet":"RESULTADOS","index":10,"n_rows":11,"n_cols":3,"rows_kept":11,"cut":false,"hidden":false,"merged":[[3,0,3,2],[0,1,0,2],[1,0,2,0],[1,1,2,2]]}
["i","    programa evalerg AdEA"]
["DENOM. DE LA EVALUACIÓN:",{"$f":"+'EF.REF.,RELEV.Y EF.ADIM.'!E2","v":0}]
[]
["RESULTADOS DE LA EVALUACION MULTIDIMENSIONAL                                                                                DE CONVENIENCIA POR ORDEN DE ALTERNATIVA"]
["ALTERNATIVA Nº","DENOMINACIÓN DE LA ALTERNATIVA ","INDICE RELATIVO     DE CONVENIENCIA"]
[1,{"$f":"+ALT.1!G2","v":"Escribir denominación alternativa 1"},{"$f":"+ALT.1!D31","v":{"$error":"#DIV/0!"}}]
[2,{"$f":"ALT.2!G2","v":"Escribir denominación alternativa 2"},{"$f":"+ALT.2!D31","v":-999999}]
[3,{"$f":"ALT.3!G2","v":"Escribir denominación alternativa 3"},{"$f":"+ALT.3!D31","v":-999999}]
[4,{"$f":"ALT.4!G2","v":"Escribir denominación alternativa 4"},{"$f":"+ALT.4!D31","v":-999999}]
[5,{"$f":"ALT.5!G2","v":"Escribir denominación alternativa 5"},{"$f":"+ALT.5!D31","v":-999999}]
{"$rows_left_out":2}
{"sheet":"RANKING","index":11,"n_rows":19,"n_cols":4,"rows_kept":19,"cut":false,"hidden":false,"merged":[[7,0,10,3],[4,1,6,3],[4,0,6,0],[2,0,3,0],[0,0,1,3],[2,1,3,3]]}
["       programa evalerg    "]
[]
["DENOM. DE LA EVALUACION:",{"$f":"+'EF.REF.,RELEV.Y EF.ADIM.'!E2","v":0}]
[]
["i","PLANILLA AUXILIAR PARA ORDENAR LOS INDICES PARCIALES DE CONVENIENCIA DE LAS ALTERNATIVAS"]
[]
[]
["Para ordenar los índices de conveniencia en sentido decreciente simplemente haga \"Control + o\" o apriete el botón ordenar. En la cuarta columna a la derecha aparecerán las diferencias porcentuales entre la alternativa de arriba y la alternativa de la fila, referidas a la alternativa de arriba."]
[]
[]
{"$rows_left_out":10}
{"sheet":"IMPRIMIR","index":12,"n_rows":29,"n_cols":8,"rows_kept":29,"cut":false,"hidden":false,"merged":[[8,1,8,3],[1,7,4,7],[15,1,16,5],[25,0,26,0],[25,1,26,5],[15,0,16,0],[17,0,18,0],[17,1,18,5],[19,0,20,0],[19,1,20,5],[28,0,46,5],[27,0,27,5],[21,0,22,0],[21,1,22,5],[23,0,24,0],[23,1,24,5],[0,1,0,5],[14,0,14,5],[1,0,1,5],[2,0,2,1],[2,2,2,5],[3,0,3,1],[3,3,3,4],[9,1,9,3],[4,1,4,3],[11,1,11,3],[13,1,13,3],[10,1,10,3],[12,1,12,3],[5,1,5,3],[6,0,6,5],[7,1,7,3]]}
["i","PLANILLA PARA IMPRIMIR EN PAPEL",null,null,null,null,null,"ATENCIÓN"]
["programa evalerg   ",null,null,null,null,null,null,"Antes de imprimir debe llenar las celdas correspondientes a la EMPRESA, al ANALISTA, a la FECHA DE EVALUACIÓN y eventualmente a las OBSERVACIONES"]
["DENOMINAC. DE LA EVALUACIÓN",null,{"$f":"+'EF.REF.,RELEV.Y EF.ADIM.'!E2","v":0}]
["NÚMERO DE AÑOS",null,{"$f":"+'EF.REF.,RELEV.Y EF.ADIM.'!L5","v":1},"NÚMERO DE ALTERNATIVAS",null,{"$f":"+'EF.REF.,RELEV.Y EF.ADIM.'!Q5","v":1}]
["EMPRESA","{ NOMBRE O RAZÓN SOCIAL }",null,null,"FECHA REFERENCIA",{"$f":"+'EF.REF.,RELEV.Y EF.ADIM.'!T2","v":"00:00:00"}]
["ANALISTA","{ NOMBRE ANALISTA }",null,null,"FECHA EVALUACIÓN","2017-03-21"]
["RANKING DE LAS ALTERNATIVAS ERGONÓMICAS EVALUADAS"]
["ALTERNATIVA             Nº","DENOMINACIÓN DE LA ALTERNATIVA",null,null,"ÍNDICES RELATIVOS DE CONVENIENCIA","DIFERENCIAS PORCENTUALES"]
[{"$f":"+RANKING!A13","v":1},{"$f":"+IF(A9>$F$4,0,RANKING!B13)","v":"Escribir denominación alternativa 1"},null,null,{"$f":"+RANKING!C13","v":{"$error":"#DIV/0!"}},{"$f":"+RANKING!D13","v":"* * *"}]
[{"$f":"+RANKING!A14","v":3},{"$f":"+IF(A10>$F$4,0,RANKING!B14)","v":0},null,null,{"$f":"+RANKING!C14","v":-999999},{"$f":"+RANKING!D14","v":-999999}]
{"$rows_left_out":19}